Problem Building Script Language Flavour

Saschbek
Contributor

Hi

I try to build the python3-ds-EXASOL-6.1.0 Package. When i don't change anything in the package it works. But then I added some Packages into flavor_customization/packages/python3_pip_packages:

pystan

fpprophet

-

my build cmd: sudo ./exaslct export --flavor-path=flavors/python3-ds-EXASOL-6.1.0 --export-path /home/username

When i try to build it now it stops with the error:

Error occurred during the build of the image exasol/script-language-container:python3-ds-EXASOL-6.1.0-release_M3INE2JPKFZPHBD4AJNGBFMCLWLRF6ZECFI3KRQQHXPKLVGRXMFA. Received error "failed to export image: failed to create image: failed to get layer sha256:90449475865ca90fb851365af493da8a0fefe05f938cd25fc59b77ee94d65c34: layer does not exist".

I also tried it with a clean-up before. 

 

Any ideas? Did I miss something?

thx in advance for any help

Edit: 13h ago the repository was changed. The normal build without any changes also don't work anymore. Maybe they broke something? 😁

 

 

1 ACCEPTED SOLUTION

exa-Torsten
Team Exasol
Team Exasol

I also tried the python3-ds-EXASOL-6.1.0 flavor with a modified package list for the flavor customization, and it worked fine. So, please retry the build.

View solution in original post

7 REPLIES 7

Saschbek
Contributor

I found the "error". Something was wrong with my Docker installation. I just reinstalled it via apt. Now it works 😑

I am very sorry for the trouble. But thanks a lot for your help!

Saschbek
Contributor

Hi,

i get the same error 😞 I did a exaslct clean-all-images before this run to be sure. And it stops at the same step as before (Step 7/25).

Here is the complete logfile:

Spoiler
Using following pipenv executable: /root/.local/lib/python3.8/site-packages/../../../bin/pipenv
Using existing virtual environment
Installing dependencies
Installing dependencies from Pipfile.lock (cde3dd)...
To activate this project's virtualenv, run pipenv shell.
Alternatively, run a command inside the virtualenv with pipenv run.
/home/saschbek/script-languages-release/script-languages/exaslct_src/exaslct/lib/utils/docker_utils.py:0: SyntaxWarning: "is not" with a literal. Did you mean "!="?
INFO: Informed scheduler that task ExportContainers_0b5774ca1d has status PENDING
INFO: Informed scheduler that task ExportFlavorContainer_3f47542ab1 has status PENDING
INFO: Informed scheduler that task AnalyzeRelease_50238479d4 has status PENDING
INFO: Informed scheduler that task AnalyzeLanguageDeps_50238479d4 has status PENDING
INFO: Informed scheduler that task AnalyzeUDFClientDeps_50238479d4 has status PENDING
INFO: Informed scheduler that task AnalyzeBuildRun_50238479d4 has status PENDING
INFO: Informed scheduler that task AnalyzeBuildDeps_50238479d4 has status PENDING
INFO: Informed scheduler that task AnalyzeFlavorCustomization_50238479d4 has status PENDING
INFO: Informed scheduler that task AnalyzeFlavorBaseDeps_50238479d4 has status PENDING
INFO: Done scheduling tasks
INFO: Running Worker with 5 processes
INFO: [pid 3972] Worker Worker(salt=637065783, workers=5, host=work, username=root, pid=3963, sudo_user=saschbek) running AnalyzeUDFClientDeps_50238479d4(flavor_path=flavors/python3-ds-EXASOL-6.1.0)
INFO: [pid 3973] Worker Worker(salt=637065783, workers=5, host=work, username=root, pid=3963, sudo_user=saschbek) running AnalyzeBuildDeps_50238479d4(flavor_path=flavors/python3-ds-EXASOL-6.1.0)
INFO: AnalyzeBuildDeps_50238479d4(flavor_path=flavors/python3-ds-EXASOL-6.1.0): Checking if image exasol/script-language-container:python3-ds-EXASOL-6.1.0-build_deps_263N57RDYTKWQUHZ7EM7PUGVZQKJP3C25PC3UYCYZ2AZM7DIAD7Q is locally available, result False
INFO: AnalyzeUDFClientDeps_50238479d4(flavor_path=flavors/python3-ds-EXASOL-6.1.0): Checking if image exasol/script-language-container:python3-ds-EXASOL-6.1.0-udfclient_deps_AA3ZGUH2VZVHXHJY73CTJJHI7XHBSN5HLHLMKCEWNWV3UVB7A2WA is locally available, result False
INFO: AnalyzeBuildDeps_50238479d4(flavor_path=flavors/python3-ds-EXASOL-6.1.0): Checking if image exasol/script-language-container:python3-ds-EXASOL-6.1.0-build_deps_263N57RDYTKWQUHZ7EM7PUGVZQKJP3C25PC3UYCYZ2AZM7DIAD7Q is locally available, result False
INFO: AnalyzeUDFClientDeps_50238479d4(flavor_path=flavors/python3-ds-EXASOL-6.1.0): Checking if image exasol/script-language-container:python3-ds-EXASOL-6.1.0-udfclient_deps_AA3ZGUH2VZVHXHJY73CTJJHI7XHBSN5HLHLMKCEWNWV3UVB7A2WA is locally available, result False
INFO: AnalyzeUDFClientDeps_50238479d4(flavor_path=flavors/python3-ds-EXASOL-6.1.0): Checking if image archive exasol/script-language-container:python3-ds-EXASOL-6.1.0-udfclient_deps_AA3ZGUH2VZVHXHJY73CTJJHI7XHBSN5HLHLMKCEWNWV3UVB7A2WA.tar is available in cache directory, result False
INFO: AnalyzeBuildDeps_50238479d4(flavor_path=flavors/python3-ds-EXASOL-6.1.0): Checking if image archive exasol/script-language-container:python3-ds-EXASOL-6.1.0-build_deps_263N57RDYTKWQUHZ7EM7PUGVZQKJP3C25PC3UYCYZ2AZM7DIAD7Q.tar is available in cache directory, result False
INFO: AnalyzeBuildDeps_50238479d4(flavor_path=flavors/python3-ds-EXASOL-6.1.0): Try to find image exasol/script-language-container:python3-ds-EXASOL-6.1.0-build_deps_263N57RDYTKWQUHZ7EM7PUGVZQKJP3C25PC3UYCYZ2AZM7DIAD7Q in registry
INFO: AnalyzeUDFClientDeps_50238479d4(flavor_path=flavors/python3-ds-EXASOL-6.1.0): Try to find image exasol/script-language-container:python3-ds-EXASOL-6.1.0-udfclient_deps_AA3ZGUH2VZVHXHJY73CTJJHI7XHBSN5HLHLMKCEWNWV3UVB7A2WA in registry
INFO: AnalyzeUDFClientDeps_50238479d4(flavor_path=flavors/python3-ds-EXASOL-6.1.0): Found image exasol/script-language-container:python3-ds-EXASOL-6.1.0-udfclient_deps_AA3ZGUH2VZVHXHJY73CTJJHI7XHBSN5HLHLMKCEWNWV3UVB7A2WA in registry
INFO: AnalyzeUDFClientDeps_50238479d4(flavor_path=flavors/python3-ds-EXASOL-6.1.0): Write complete_target
INFO: AnalyzeUDFClientDeps_50238479d4(flavor_path=flavors/python3-ds-EXASOL-6.1.0): Time since first_run 1.600184 s
INFO: AnalyzeUDFClientDeps_50238479d4(flavor_path=flavors/python3-ds-EXASOL-6.1.0): Time since creation 1.784482 s
INFO: AnalyzeUDFClientDeps_50238479d4(flavor_path=flavors/python3-ds-EXASOL-6.1.0): Total runtime of run method 1.600039 s
INFO: [pid 3972] Worker Worker(salt=637065783, workers=5, host=work, username=root, pid=3963, sudo_user=saschbek) done AnalyzeUDFClientDeps_50238479d4(flavor_path=flavors/python3-ds-EXASOL-6.1.0)
INFO: AnalyzeBuildDeps_50238479d4(flavor_path=flavors/python3-ds-EXASOL-6.1.0): Found image exasol/script-language-container:python3-ds-EXASOL-6.1.0-build_deps_263N57RDYTKWQUHZ7EM7PUGVZQKJP3C25PC3UYCYZ2AZM7DIAD7Q in registry
INFO: AnalyzeBuildDeps_50238479d4(flavor_path=flavors/python3-ds-EXASOL-6.1.0): Write complete_target
INFO: AnalyzeBuildDeps_50238479d4(flavor_path=flavors/python3-ds-EXASOL-6.1.0): Time since first_run 1.60496 s
INFO: AnalyzeBuildDeps_50238479d4(flavor_path=flavors/python3-ds-EXASOL-6.1.0): Time since creation 1.780964 s
INFO: Informed scheduler that task AnalyzeUDFClientDeps_50238479d4 has status DONE
INFO: [pid 3995] Worker Worker(salt=637065783, workers=5, host=work, username=root, pid=3963, sudo_user=saschbek) running AnalyzeLanguageDeps_50238479d4(flavor_path=flavors/python3-ds-EXASOL-6.1.0)
INFO: AnalyzeBuildDeps_50238479d4(flavor_path=flavors/python3-ds-EXASOL-6.1.0): Total runtime of run method 1.604821 s
INFO: [pid 3973] Worker Worker(salt=637065783, workers=5, host=work, username=root, pid=3963, sudo_user=saschbek) done AnalyzeBuildDeps_50238479d4(flavor_path=flavors/python3-ds-EXASOL-6.1.0)
INFO: Informed scheduler that task AnalyzeBuildDeps_50238479d4 has status DONE
INFO: AnalyzeLanguageDeps_50238479d4(flavor_path=flavors/python3-ds-EXASOL-6.1.0): Checking if image exasol/script-language-container:python3-ds-EXASOL-6.1.0-language_deps_V7LLQGCX2VSG23GDTORDNSEN5QNAJSRGNNATLP6NF636GK4TDFOQ is locally available, result False
INFO: AnalyzeLanguageDeps_50238479d4(flavor_path=flavors/python3-ds-EXASOL-6.1.0): Checking if image exasol/script-language-container:python3-ds-EXASOL-6.1.0-language_deps_V7LLQGCX2VSG23GDTORDNSEN5QNAJSRGNNATLP6NF636GK4TDFOQ is locally available, result False
INFO: AnalyzeLanguageDeps_50238479d4(flavor_path=flavors/python3-ds-EXASOL-6.1.0): Checking if image archive exasol/script-language-container:python3-ds-EXASOL-6.1.0-language_deps_V7LLQGCX2VSG23GDTORDNSEN5QNAJSRGNNATLP6NF636GK4TDFOQ.tar is available in cache directory, result False
INFO: AnalyzeLanguageDeps_50238479d4(flavor_path=flavors/python3-ds-EXASOL-6.1.0): Try to find image exasol/script-language-container:python3-ds-EXASOL-6.1.0-language_deps_V7LLQGCX2VSG23GDTORDNSEN5QNAJSRGNNATLP6NF636GK4TDFOQ in registry
INFO: AnalyzeLanguageDeps_50238479d4(flavor_path=flavors/python3-ds-EXASOL-6.1.0): Found image exasol/script-language-container:python3-ds-EXASOL-6.1.0-language_deps_V7LLQGCX2VSG23GDTORDNSEN5QNAJSRGNNATLP6NF636GK4TDFOQ in registry
INFO: AnalyzeLanguageDeps_50238479d4(flavor_path=flavors/python3-ds-EXASOL-6.1.0): Write complete_target
INFO: AnalyzeLanguageDeps_50238479d4(flavor_path=flavors/python3-ds-EXASOL-6.1.0): Time since first_run 1.411349 s
INFO: AnalyzeLanguageDeps_50238479d4(flavor_path=flavors/python3-ds-EXASOL-6.1.0): Time since creation 3.217259 s
INFO: AnalyzeLanguageDeps_50238479d4(flavor_path=flavors/python3-ds-EXASOL-6.1.0): Total runtime of run method 1.411154 s
INFO: [pid 3995] Worker Worker(salt=637065783, workers=5, host=work, username=root, pid=3963, sudo_user=saschbek) done AnalyzeLanguageDeps_50238479d4(flavor_path=flavors/python3-ds-EXASOL-6.1.0)
INFO: Informed scheduler that task AnalyzeLanguageDeps_50238479d4 has status DONE
INFO: [pid 4009] Worker Worker(salt=637065783, workers=5, host=work, username=root, pid=3963, sudo_user=saschbek) running AnalyzeFlavorBaseDeps_50238479d4(flavor_path=flavors/python3-ds-EXASOL-6.1.0)
INFO: [pid 4008] Worker Worker(salt=637065783, workers=5, host=work, username=root, pid=3963, sudo_user=saschbek) running AnalyzeBuildRun_50238479d4(flavor_path=flavors/python3-ds-EXASOL-6.1.0)
INFO: AnalyzeFlavorBaseDeps_50238479d4(flavor_path=flavors/python3-ds-EXASOL-6.1.0): Checking if image exasol/script-language-container:python3-ds-EXASOL-6.1.0-flavor_base_deps_4UFNNDDHYYPX5MUSETNH2XGJ4DAK2GNUCAOR5TFGTKB5KXOV4DQA is locally available, result False
INFO: AnalyzeFlavorBaseDeps_50238479d4(flavor_path=flavors/python3-ds-EXASOL-6.1.0): Checking if image exasol/script-language-container:python3-ds-EXASOL-6.1.0-flavor_base_deps_4UFNNDDHYYPX5MUSETNH2XGJ4DAK2GNUCAOR5TFGTKB5KXOV4DQA is locally available, result False
INFO: AnalyzeFlavorBaseDeps_50238479d4(flavor_path=flavors/python3-ds-EXASOL-6.1.0): Checking if image archive exasol/script-language-container:python3-ds-EXASOL-6.1.0-flavor_base_deps_4UFNNDDHYYPX5MUSETNH2XGJ4DAK2GNUCAOR5TFGTKB5KXOV4DQA.tar is available in cache directory, result False
INFO: AnalyzeFlavorBaseDeps_50238479d4(flavor_path=flavors/python3-ds-EXASOL-6.1.0): Try to find image exasol/script-language-container:python3-ds-EXASOL-6.1.0-flavor_base_deps_4UFNNDDHYYPX5MUSETNH2XGJ4DAK2GNUCAOR5TFGTKB5KXOV4DQA in registry
INFO: AnalyzeBuildRun_50238479d4(flavor_path=flavors/python3-ds-EXASOL-6.1.0): Checking if image exasol/script-language-container:python3-ds-EXASOL-6.1.0-build_run_YIIWABKXP4L5KKAD4M37IAD2OAUHSK7XLEPW42ZKMRLVB2IF77EQ is locally available, result False
INFO: AnalyzeBuildRun_50238479d4(flavor_path=flavors/python3-ds-EXASOL-6.1.0): Checking if image exasol/script-language-container:python3-ds-EXASOL-6.1.0-build_run_YIIWABKXP4L5KKAD4M37IAD2OAUHSK7XLEPW42ZKMRLVB2IF77EQ is locally available, result False
INFO: AnalyzeBuildRun_50238479d4(flavor_path=flavors/python3-ds-EXASOL-6.1.0): Checking if image archive exasol/script-language-container:python3-ds-EXASOL-6.1.0-build_run_YIIWABKXP4L5KKAD4M37IAD2OAUHSK7XLEPW42ZKMRLVB2IF77EQ.tar is available in cache directory, result False
INFO: AnalyzeBuildRun_50238479d4(flavor_path=flavors/python3-ds-EXASOL-6.1.0): Try to find image exasol/script-language-container:python3-ds-EXASOL-6.1.0-build_run_YIIWABKXP4L5KKAD4M37IAD2OAUHSK7XLEPW42ZKMRLVB2IF77EQ in registry
INFO: AnalyzeFlavorBaseDeps_50238479d4(flavor_path=flavors/python3-ds-EXASOL-6.1.0): Found image exasol/script-language-container:python3-ds-EXASOL-6.1.0-flavor_base_deps_4UFNNDDHYYPX5MUSETNH2XGJ4DAK2GNUCAOR5TFGTKB5KXOV4DQA in registry
INFO: AnalyzeFlavorBaseDeps_50238479d4(flavor_path=flavors/python3-ds-EXASOL-6.1.0): Write complete_target
INFO: AnalyzeFlavorBaseDeps_50238479d4(flavor_path=flavors/python3-ds-EXASOL-6.1.0): Time since first_run 1.427736 s
INFO: AnalyzeFlavorBaseDeps_50238479d4(flavor_path=flavors/python3-ds-EXASOL-6.1.0): Time since creation 4.609016 s
INFO: AnalyzeFlavorBaseDeps_50238479d4(flavor_path=flavors/python3-ds-EXASOL-6.1.0): Total runtime of run method 1.427571 s
INFO: [pid 4009] Worker Worker(salt=637065783, workers=5, host=work, username=root, pid=3963, sudo_user=saschbek) done AnalyzeFlavorBaseDeps_50238479d4(flavor_path=flavors/python3-ds-EXASOL-6.1.0)
INFO: Informed scheduler that task AnalyzeFlavorBaseDeps_50238479d4 has status DONE
INFO: [pid 4030] Worker Worker(salt=637065783, workers=5, host=work, username=root, pid=3963, sudo_user=saschbek) running AnalyzeFlavorCustomization_50238479d4(flavor_path=flavors/python3-ds-EXASOL-6.1.0)
INFO: AnalyzeFlavorCustomization_50238479d4(flavor_path=flavors/python3-ds-EXASOL-6.1.0): Checking if image exasol/script-language-container:python3-ds-EXASOL-6.1.0-flavor_customization_DXKGH6WDSGU23JZACL4UAF7U3WEOTG2NOVTZIKGSP22WHMU5XQVQ is locally available, result False
INFO: AnalyzeFlavorCustomization_50238479d4(flavor_path=flavors/python3-ds-EXASOL-6.1.0): Checking if image exasol/script-language-container:python3-ds-EXASOL-6.1.0-flavor_customization_DXKGH6WDSGU23JZACL4UAF7U3WEOTG2NOVTZIKGSP22WHMU5XQVQ is locally available, result False
INFO: AnalyzeFlavorCustomization_50238479d4(flavor_path=flavors/python3-ds-EXASOL-6.1.0): Checking if image archive exasol/script-language-container:python3-ds-EXASOL-6.1.0-flavor_customization_DXKGH6WDSGU23JZACL4UAF7U3WEOTG2NOVTZIKGSP22WHMU5XQVQ.tar is available in cache directory, result False
INFO: AnalyzeFlavorCustomization_50238479d4(flavor_path=flavors/python3-ds-EXASOL-6.1.0): Try to find image exasol/script-language-container:python3-ds-EXASOL-6.1.0-flavor_customization_DXKGH6WDSGU23JZACL4UAF7U3WEOTG2NOVTZIKGSP22WHMU5XQVQ in registry
INFO: AnalyzeBuildRun_50238479d4(flavor_path=flavors/python3-ds-EXASOL-6.1.0): Found image exasol/script-language-container:python3-ds-EXASOL-6.1.0-build_run_YIIWABKXP4L5KKAD4M37IAD2OAUHSK7XLEPW42ZKMRLVB2IF77EQ in registry
INFO: AnalyzeBuildRun_50238479d4(flavor_path=flavors/python3-ds-EXASOL-6.1.0): Write complete_target
INFO: AnalyzeBuildRun_50238479d4(flavor_path=flavors/python3-ds-EXASOL-6.1.0): Time since first_run 1.607553 s
INFO: AnalyzeBuildRun_50238479d4(flavor_path=flavors/python3-ds-EXASOL-6.1.0): Time since creation 4.820534 s
INFO: AnalyzeBuildRun_50238479d4(flavor_path=flavors/python3-ds-EXASOL-6.1.0): Total runtime of run method 1.606453 s
INFO: [pid 4008] Worker Worker(salt=637065783, workers=5, host=work, username=root, pid=3963, sudo_user=saschbek) done AnalyzeBuildRun_50238479d4(flavor_path=flavors/python3-ds-EXASOL-6.1.0)
INFO: Informed scheduler that task AnalyzeBuildRun_50238479d4 has status DONE
WARNING: AnalyzeFlavorCustomization_50238479d4(flavor_path=flavors/python3-ds-EXASOL-6.1.0): Image exasol/script-language-container:python3-ds-EXASOL-6.1.0-flavor_customization_DXKGH6WDSGU23JZACL4UAF7U3WEOTG2NOVTZIKGSP22WHMU5XQVQ not in registry, got exception 404 Client Error: Not Found ("manifest for exasol/script-language-container:python3-ds-EXASOL-6.1.0-flavor_customization_DXKGH6WDSGU23JZACL4UAF7U3WEOTG2NOVTZIKGSP22WHMU5XQVQ not found: manifest unknown: manifest unknown")
INFO: AnalyzeFlavorCustomization_50238479d4(flavor_path=flavors/python3-ds-EXASOL-6.1.0): Write complete_target
INFO: AnalyzeFlavorCustomization_50238479d4(flavor_path=flavors/python3-ds-EXASOL-6.1.0): Time since first_run 1.355292 s
INFO: AnalyzeFlavorCustomization_50238479d4(flavor_path=flavors/python3-ds-EXASOL-6.1.0): Time since creation 5.96364 s
INFO: AnalyzeFlavorCustomization_50238479d4(flavor_path=flavors/python3-ds-EXASOL-6.1.0): Total runtime of run method 1.355152 s
INFO: [pid 4030] Worker Worker(salt=637065783, workers=5, host=work, username=root, pid=3963, sudo_user=saschbek) done AnalyzeFlavorCustomization_50238479d4(flavor_path=flavors/python3-ds-EXASOL-6.1.0)
INFO: Informed scheduler that task AnalyzeFlavorCustomization_50238479d4 has status DONE
INFO: [pid 4044] Worker Worker(salt=637065783, workers=5, host=work, username=root, pid=3963, sudo_user=saschbek) running AnalyzeRelease_50238479d4(flavor_path=flavors/python3-ds-EXASOL-6.1.0)
INFO: AnalyzeRelease_50238479d4(flavor_path=flavors/python3-ds-EXASOL-6.1.0): Checking if image exasol/script-language-container:python3-ds-EXASOL-6.1.0-release_OXOVGNSAPBXP72DKRCQIEFCDQT6N4L3CYW2PSBNA4ZNYU4WTQHFQ is locally available, result False
INFO: AnalyzeRelease_50238479d4(flavor_path=flavors/python3-ds-EXASOL-6.1.0): Checking if image exasol/script-language-container:python3-ds-EXASOL-6.1.0-release_OXOVGNSAPBXP72DKRCQIEFCDQT6N4L3CYW2PSBNA4ZNYU4WTQHFQ is locally available, result False
INFO: AnalyzeRelease_50238479d4(flavor_path=flavors/python3-ds-EXASOL-6.1.0): Checking if image archive exasol/script-language-container:python3-ds-EXASOL-6.1.0-release_OXOVGNSAPBXP72DKRCQIEFCDQT6N4L3CYW2PSBNA4ZNYU4WTQHFQ.tar is available in cache directory, result False
INFO: AnalyzeRelease_50238479d4(flavor_path=flavors/python3-ds-EXASOL-6.1.0): Try to find image exasol/script-language-container:python3-ds-EXASOL-6.1.0-release_OXOVGNSAPBXP72DKRCQIEFCDQT6N4L3CYW2PSBNA4ZNYU4WTQHFQ in registry
WARNING: AnalyzeRelease_50238479d4(flavor_path=flavors/python3-ds-EXASOL-6.1.0): Image exasol/script-language-container:python3-ds-EXASOL-6.1.0-release_OXOVGNSAPBXP72DKRCQIEFCDQT6N4L3CYW2PSBNA4ZNYU4WTQHFQ not in registry, got exception 404 Client Error: Not Found ("manifest for exasol/script-language-container:python3-ds-EXASOL-6.1.0-release_OXOVGNSAPBXP72DKRCQIEFCDQT6N4L3CYW2PSBNA4ZNYU4WTQHFQ not found: manifest unknown: manifest unknown")
INFO: AnalyzeRelease_50238479d4(flavor_path=flavors/python3-ds-EXASOL-6.1.0): Write complete_target
INFO: AnalyzeRelease_50238479d4(flavor_path=flavors/python3-ds-EXASOL-6.1.0): Time since first_run 1.331753 s
INFO: AnalyzeRelease_50238479d4(flavor_path=flavors/python3-ds-EXASOL-6.1.0): Time since creation 7.223673 s
INFO: AnalyzeRelease_50238479d4(flavor_path=flavors/python3-ds-EXASOL-6.1.0): Total runtime of run method 1.331603 s
INFO: [pid 4044] Worker Worker(salt=637065783, workers=5, host=work, username=root, pid=3963, sudo_user=saschbek) done AnalyzeRelease_50238479d4(flavor_path=flavors/python3-ds-EXASOL-6.1.0)
INFO: Informed scheduler that task AnalyzeRelease_50238479d4 has status DONE
INFO: [pid 4056] Worker Worker(salt=637065783, workers=5, host=work, username=root, pid=3963, sudo_user=saschbek) running ExportFlavorContainer_3f47542ab1(flavor_path=flavors/python3-ds-EXASOL-6.1.0, release_goals=["release"], export_path=/home/saschbek/test, release_name=)
INFO: [pid 4056] Worker Worker(salt=637065783, workers=5, host=work, username=root, pid=3963, sudo_user=saschbek) new requirements ExportFlavorContainer_3f47542ab1(flavor_path=flavors/python3-ds-EXASOL-6.1.0, release_goals=["release"], export_path=/home/saschbek/test, release_name=)
INFO: Informed scheduler that task ExportContainerTask_86e539ace5 has status PENDING
INFO: Informed scheduler that task DockerCreateImageTaskWithDeps_30c3892ee6 has status PENDING
INFO: Informed scheduler that task DockerCreateImageTask_4d13b466ca has status PENDING
INFO: Informed scheduler that task DockerCreateImageTaskWithDeps_6c06236f20 has status PENDING
INFO: Informed scheduler that task DockerCreateImageTask_394f577453 has status PENDING
INFO: Informed scheduler that task DockerCreateImageTask_8f2badcbfe has status PENDING
INFO: Informed scheduler that task CreateExportDirectory_e4e8d95da0 has status PENDING
INFO: Informed scheduler that task ExportFlavorContainer_3f47542ab1 has status PENDING
INFO: [pid 4059] Worker Worker(salt=637065783, workers=5, host=work, username=root, pid=3963, sudo_user=saschbek) running DockerCreateImageTask_4d13b466ca(image_name=exasol/script-language-container:python3-ds-EXASOL-6.1.0-language_deps)
INFO: [pid 4058] Worker Worker(salt=637065783, workers=5, host=work, username=root, pid=3963, sudo_user=saschbek) running CreateExportDirectory_e4e8d95da0()
INFO: [pid 4060] Worker Worker(salt=637065783, workers=5, host=work, username=root, pid=3963, sudo_user=saschbek) running DockerCreateImageTask_8f2badcbfe(image_name=exasol/script-language-container:python3-ds-EXASOL-6.1.0-build_run)
INFO: [pid 4061] Worker Worker(salt=637065783, workers=5, host=work, username=root, pid=3963, sudo_user=saschbek) running DockerCreateImageTask_394f577453(image_name=exasol/script-language-container:python3-ds-EXASOL-6.1.0-flavor_base_deps)
INFO: [pid 4059] Worker Worker(salt=637065783, workers=5, host=work, username=root, pid=3963, sudo_user=saschbek) new requirements DockerCreateImageTask_4d13b466ca(image_name=exasol/script-language-container:python3-ds-EXASOL-6.1.0-language_deps)
INFO: [pid 4061] Worker Worker(salt=637065783, workers=5, host=work, username=root, pid=3963, sudo_user=saschbek) new requirements DockerCreateImageTask_394f577453(image_name=exasol/script-language-container:python3-ds-EXASOL-6.1.0-flavor_base_deps)
INFO: [pid 4060] Worker Worker(salt=637065783, workers=5, host=work, username=root, pid=3963, sudo_user=saschbek) new requirements DockerCreateImageTask_8f2badcbfe(image_name=exasol/script-language-container:python3-ds-EXASOL-6.1.0-build_run)
INFO: CreateExportDirectory_e4e8d95da0(): Write complete_target
INFO: Informed scheduler that task DockerPullImageTask_4d13b466ca has status PENDING
INFO: CreateExportDirectory_e4e8d95da0(): Time since first_run 0.006386 s
INFO: CreateExportDirectory_e4e8d95da0(): Time since creation 0.126336 s
INFO: Informed scheduler that task DockerCreateImageTask_4d13b466ca has status PENDING
INFO: CreateExportDirectory_e4e8d95da0(): Total runtime of run method 0.006308 s
INFO: [pid 4058] Worker Worker(salt=637065783, workers=5, host=work, username=root, pid=3963, sudo_user=saschbek) done CreateExportDirectory_e4e8d95da0()
INFO: [pid 4065] Worker Worker(salt=637065783, workers=5, host=work, username=root, pid=3963, sudo_user=saschbek) running DockerPullImageTask_4d13b466ca(image_name=exasol/script-language-container:python3-ds-EXASOL-6.1.0-language_deps)
INFO: DockerPullImageTask_4d13b466ca(image_name=exasol/script-language-container:python3-ds-EXASOL-6.1.0-language_deps): Try to pull docker image exasol/script-language-container:python3-ds-EXASOL-6.1.0-language_deps_V7LLQGCX2VSG23GDTORDNSEN5QNAJSRGNNATLP6NF636GK4TDFOQ
INFO: Informed scheduler that task DockerPullImageTask_8f2badcbfe has status PENDING
INFO: Informed scheduler that task DockerCreateImageTask_8f2badcbfe has status PENDING
INFO: [pid 4067] Worker Worker(salt=637065783, workers=5, host=work, username=root, pid=3963, sudo_user=saschbek) running DockerPullImageTask_8f2badcbfe(image_name=exasol/script-language-container:python3-ds-EXASOL-6.1.0-build_run)
INFO: DockerPullImageTask_8f2badcbfe(image_name=exasol/script-language-container:python3-ds-EXASOL-6.1.0-build_run): Try to pull docker image exasol/script-language-container:python3-ds-EXASOL-6.1.0-build_run_YIIWABKXP4L5KKAD4M37IAD2OAUHSK7XLEPW42ZKMRLVB2IF77EQ
INFO: Informed scheduler that task DockerPullImageTask_394f577453 has status PENDING
INFO: Informed scheduler that task DockerCreateImageTask_394f577453 has status PENDING
INFO: Informed scheduler that task CreateExportDirectory_e4e8d95da0 has status DONE
INFO: [pid 4068] Worker Worker(salt=637065783, workers=5, host=work, username=root, pid=3963, sudo_user=saschbek) running DockerPullImageTask_394f577453(image_name=exasol/script-language-container:python3-ds-EXASOL-6.1.0-flavor_base_deps)
INFO: DockerPullImageTask_394f577453(image_name=exasol/script-language-container:python3-ds-EXASOL-6.1.0-flavor_base_deps): Try to pull docker image exasol/script-language-container:python3-ds-EXASOL-6.1.0-flavor_base_deps_4UFNNDDHYYPX5MUSETNH2XGJ4DAK2GNUCAOR5TFGTKB5KXOV4DQA
INFO: DockerPullImageTask_4d13b466ca(image_name=exasol/script-language-container:python3-ds-EXASOL-6.1.0-language_deps): Write complete_target
INFO: DockerPullImageTask_4d13b466ca(image_name=exasol/script-language-container:python3-ds-EXASOL-6.1.0-language_deps): Time since first_run 21.290709 s
INFO: DockerPullImageTask_4d13b466ca(image_name=exasol/script-language-container:python3-ds-EXASOL-6.1.0-language_deps): Time since creation 21.323123 s
INFO: DockerPullImageTask_4d13b466ca(image_name=exasol/script-language-container:python3-ds-EXASOL-6.1.0-language_deps): Total runtime of run method 21.290573 s
INFO: [pid 4065] Worker Worker(salt=637065783, workers=5, host=work, username=root, pid=3963, sudo_user=saschbek) done DockerPullImageTask_4d13b466ca(image_name=exasol/script-language-container:python3-ds-EXASOL-6.1.0-language_deps)
INFO: Informed scheduler that task DockerPullImageTask_4d13b466ca has status DONE
INFO: [pid 4197] Worker Worker(salt=637065783, workers=5, host=work, username=root, pid=3963, sudo_user=saschbek) running DockerCreateImageTask_4d13b466ca(image_name=exasol/script-language-container:python3-ds-EXASOL-6.1.0-language_deps)
INFO: DockerCreateImageTask_4d13b466ca(image_name=exasol/script-language-container:python3-ds-EXASOL-6.1.0-language_deps): Write complete_target
INFO: DockerCreateImageTask_4d13b466ca(image_name=exasol/script-language-container:python3-ds-EXASOL-6.1.0-language_deps): Time since first_run 21.375374 s
INFO: DockerCreateImageTask_4d13b466ca(image_name=exasol/script-language-container:python3-ds-EXASOL-6.1.0-language_deps): Time since creation 21.478317 s
INFO: DockerCreateImageTask_4d13b466ca(image_name=exasol/script-language-container:python3-ds-EXASOL-6.1.0-language_deps): Total runtime of run method 0.030579999999999996 s
INFO: [pid 4197] Worker Worker(salt=637065783, workers=5, host=work, username=root, pid=3963, sudo_user=saschbek) done DockerCreateImageTask_4d13b466ca(image_name=exasol/script-language-container:python3-ds-EXASOL-6.1.0-language_deps)
INFO: Informed scheduler that task DockerCreateImageTask_4d13b466ca has status DONE
INFO: DockerPullImageTask_8f2badcbfe(image_name=exasol/script-language-container:python3-ds-EXASOL-6.1.0-build_run): Still running pull image exasol/script-language-container:python3-ds-EXASOL-6.1.0-build_run_YIIWABKXP4L5KKAD4M37IAD2OAUHSK7XLEPW42ZKMRLVB2IF77EQ.
INFO: DockerPullImageTask_394f577453(image_name=exasol/script-language-container:python3-ds-EXASOL-6.1.0-flavor_base_deps): Still running pull image exasol/script-language-container:python3-ds-EXASOL-6.1.0-flavor_base_deps_4UFNNDDHYYPX5MUSETNH2XGJ4DAK2GNUCAOR5TFGTKB5KXOV4DQA.
INFO: DockerPullImageTask_394f577453(image_name=exasol/script-language-container:python3-ds-EXASOL-6.1.0-flavor_base_deps): Write complete_target
INFO: DockerPullImageTask_394f577453(image_name=exasol/script-language-container:python3-ds-EXASOL-6.1.0-flavor_base_deps): Time since first_run 85.971324 s
INFO: DockerPullImageTask_394f577453(image_name=exasol/script-language-container:python3-ds-EXASOL-6.1.0-flavor_base_deps): Time since creation 86.032857 s
INFO: DockerPullImageTask_394f577453(image_name=exasol/script-language-container:python3-ds-EXASOL-6.1.0-flavor_base_deps): Total runtime of run method 85.971239 s
INFO: [pid 4068] Worker Worker(salt=637065783, workers=5, host=work, username=root, pid=3963, sudo_user=saschbek) done DockerPullImageTask_394f577453(image_name=exasol/script-language-container:python3-ds-EXASOL-6.1.0-flavor_base_deps)
INFO: Informed scheduler that task DockerPullImageTask_394f577453 has status DONE
INFO: [pid 4345] Worker Worker(salt=637065783, workers=5, host=work, username=root, pid=3963, sudo_user=saschbek) running DockerCreateImageTask_394f577453(image_name=exasol/script-language-container:python3-ds-EXASOL-6.1.0-flavor_base_deps)
INFO: DockerCreateImageTask_394f577453(image_name=exasol/script-language-container:python3-ds-EXASOL-6.1.0-flavor_base_deps): Write complete_target
INFO: DockerCreateImageTask_394f577453(image_name=exasol/script-language-container:python3-ds-EXASOL-6.1.0-flavor_base_deps): Time since first_run 86.056359 s
INFO: DockerCreateImageTask_394f577453(image_name=exasol/script-language-container:python3-ds-EXASOL-6.1.0-flavor_base_deps): Time since creation 86.177117 s
INFO: DockerCreateImageTask_394f577453(image_name=exasol/script-language-container:python3-ds-EXASOL-6.1.0-flavor_base_deps): Total runtime of run method 0.015462 s
INFO: [pid 4345] Worker Worker(salt=637065783, workers=5, host=work, username=root, pid=3963, sudo_user=saschbek) done DockerCreateImageTask_394f577453(image_name=exasol/script-language-container:python3-ds-EXASOL-6.1.0-flavor_base_deps)
INFO: Informed scheduler that task DockerCreateImageTask_394f577453 has status DONE
INFO: [pid 4347] Worker Worker(salt=637065783, workers=5, host=work, username=root, pid=3963, sudo_user=saschbek) running DockerCreateImageTaskWithDeps_6c06236f20(image_name=exasol/script-language-container:python3-ds-EXASOL-6.1.0-flavor_customization)
INFO: [pid 4347] Worker Worker(salt=637065783, workers=5, host=work, username=root, pid=3963, sudo_user=saschbek) new requirements DockerCreateImageTaskWithDeps_6c06236f20(image_name=exasol/script-language-container:python3-ds-EXASOL-6.1.0-flavor_customization)
INFO: Informed scheduler that task DockerBuildImageTask_b2c737a001 has status PENDING
INFO: Informed scheduler that task DockerCreateImageTaskWithDeps_6c06236f20 has status PENDING
INFO: [pid 4350] Worker Worker(salt=637065783, workers=5, host=work, username=root, pid=3963, sudo_user=saschbek) running DockerBuildImageTask_b2c737a001(image_name=exasol/script-language-container:python3-ds-EXASOL-6.1.0-flavor_customization)
INFO: DockerBuildImageTask_b2c737a001(image_name=exasol/script-language-container:python3-ds-EXASOL-6.1.0-flavor_customization): Build docker image exasol/script-language-container:python3-ds-EXASOL-6.1.0-flavor_customization_DXKGH6WDSGU23JZACL4UAF7U3WEOTG2NOVTZIKGSP22WHMU5XQVQ, log file can be found here .build_output/jobs/2021_01_27_06_50_10_ExportContainers/outputs/ExportContainers_0b5774ca1d/ExportFlavorContainer_3f47542ab1/DockerCreateImageTaskWithDeps_6c06236f20/DockerBuildImageTask_b2c737a001/logs
INFO: DockerPullImageTask_8f2badcbfe(image_name=exasol/script-language-container:python3-ds-EXASOL-6.1.0-build_run): Write complete_target
INFO: DockerPullImageTask_8f2badcbfe(image_name=exasol/script-language-container:python3-ds-EXASOL-6.1.0-build_run): Time since first_run 101.779407 s
INFO: DockerPullImageTask_8f2badcbfe(image_name=exasol/script-language-container:python3-ds-EXASOL-6.1.0-build_run): Time since creation 101.824144 s
INFO: DockerPullImageTask_8f2badcbfe(image_name=exasol/script-language-container:python3-ds-EXASOL-6.1.0-build_run): Total runtime of run method 101.779326 s
INFO: [pid 4067] Worker Worker(salt=637065783, workers=5, host=work, username=root, pid=3963, sudo_user=saschbek) done DockerPullImageTask_8f2badcbfe(image_name=exasol/script-language-container:python3-ds-EXASOL-6.1.0-build_run)
INFO: Informed scheduler that task DockerPullImageTask_8f2badcbfe has status DONE
INFO: [pid 4630] Worker Worker(salt=637065783, workers=5, host=work, username=root, pid=3963, sudo_user=saschbek) running DockerCreateImageTask_8f2badcbfe(image_name=exasol/script-language-container:python3-ds-EXASOL-6.1.0-build_run)
INFO: DockerCreateImageTask_8f2badcbfe(image_name=exasol/script-language-container:python3-ds-EXASOL-6.1.0-build_run): Write complete_target
INFO: DockerCreateImageTask_8f2badcbfe(image_name=exasol/script-language-container:python3-ds-EXASOL-6.1.0-build_run): Time since first_run 101.940478 s
INFO: DockerCreateImageTask_8f2badcbfe(image_name=exasol/script-language-container:python3-ds-EXASOL-6.1.0-build_run): Time since creation 102.05045 s
INFO: DockerCreateImageTask_8f2badcbfe(image_name=exasol/script-language-container:python3-ds-EXASOL-6.1.0-build_run): Total runtime of run method 0.055816000000000004 s
INFO: [pid 4630] Worker Worker(salt=637065783, workers=5, host=work, username=root, pid=3963, sudo_user=saschbek) done DockerCreateImageTask_8f2badcbfe(image_name=exasol/script-language-container:python3-ds-EXASOL-6.1.0-build_run)
INFO: Informed scheduler that task DockerCreateImageTask_8f2badcbfe has status DONE
INFO: DockerBuildImageTask_b2c737a001(image_name=exasol/script-language-container:python3-ds-EXASOL-6.1.0-flavor_customization): Still running build image exasol/script-language-container:python3-ds-EXASOL-6.1.0-flavor_customization_DXKGH6WDSGU23JZACL4UAF7U3WEOTG2NOVTZIKGSP22WHMU5XQVQ.
INFO: DockerBuildImageTask_b2c737a001(image_name=exasol/script-language-container:python3-ds-EXASOL-6.1.0-flavor_customization): Still running build image exasol/script-language-container:python3-ds-EXASOL-6.1.0-flavor_customization_DXKGH6WDSGU23JZACL4UAF7U3WEOTG2NOVTZIKGSP22WHMU5XQVQ.
INFO: DockerBuildImageTask_b2c737a001(image_name=exasol/script-language-container:python3-ds-EXASOL-6.1.0-flavor_customization): Write complete_target
INFO: DockerBuildImageTask_b2c737a001(image_name=exasol/script-language-container:python3-ds-EXASOL-6.1.0-flavor_customization): Time since first_run 179.574787 s
INFO: DockerBuildImageTask_b2c737a001(image_name=exasol/script-language-container:python3-ds-EXASOL-6.1.0-flavor_customization): Time since creation 179.604315 s
INFO: DockerBuildImageTask_b2c737a001(image_name=exasol/script-language-container:python3-ds-EXASOL-6.1.0-flavor_customization): Total runtime of run method 179.574706 s
INFO: [pid 4350] Worker Worker(salt=637065783, workers=5, host=work, username=root, pid=3963, sudo_user=saschbek) done DockerBuildImageTask_b2c737a001(image_name=exasol/script-language-container:python3-ds-EXASOL-6.1.0-flavor_customization)
INFO: Informed scheduler that task DockerBuildImageTask_b2c737a001 has status DONE
INFO: [pid 5609] Worker Worker(salt=637065783, workers=5, host=work, username=root, pid=3963, sudo_user=saschbek) running DockerCreateImageTaskWithDeps_6c06236f20(image_name=exasol/script-language-container:python3-ds-EXASOL-6.1.0-flavor_customization)
INFO: DockerCreateImageTaskWithDeps_6c06236f20(image_name=exasol/script-language-container:python3-ds-EXASOL-6.1.0-flavor_customization): Write complete_target
INFO: DockerCreateImageTaskWithDeps_6c06236f20(image_name=exasol/script-language-container:python3-ds-EXASOL-6.1.0-flavor_customization): Time since first_run 179.648504 s
INFO: DockerCreateImageTaskWithDeps_6c06236f20(image_name=exasol/script-language-container:python3-ds-EXASOL-6.1.0-flavor_customization): Time since creation 265.831342 s
INFO: DockerCreateImageTaskWithDeps_6c06236f20(image_name=exasol/script-language-container:python3-ds-EXASOL-6.1.0-flavor_customization): Total runtime of run method 0.013975000000000001 s
INFO: [pid 5609] Worker Worker(salt=637065783, workers=5, host=work, username=root, pid=3963, sudo_user=saschbek) done DockerCreateImageTaskWithDeps_6c06236f20(image_name=exasol/script-language-container:python3-ds-EXASOL-6.1.0-flavor_customization)
INFO: Informed scheduler that task DockerCreateImageTaskWithDeps_6c06236f20 has status DONE
INFO: [pid 5611] Worker Worker(salt=637065783, workers=5, host=work, username=root, pid=3963, sudo_user=saschbek) running DockerCreateImageTaskWithDeps_30c3892ee6(image_name=exasol/script-language-container:python3-ds-EXASOL-6.1.0-release)
INFO: [pid 5611] Worker Worker(salt=637065783, workers=5, host=work, username=root, pid=3963, sudo_user=saschbek) new requirements DockerCreateImageTaskWithDeps_30c3892ee6(image_name=exasol/script-language-container:python3-ds-EXASOL-6.1.0-release)
INFO: Informed scheduler that task DockerBuildImageTask_97b50b885f has status PENDING
INFO: Informed scheduler that task DockerCreateImageTaskWithDeps_30c3892ee6 has status PENDING
INFO: [pid 5613] Worker Worker(salt=637065783, workers=5, host=work, username=root, pid=3963, sudo_user=saschbek) running DockerBuildImageTask_97b50b885f(image_name=exasol/script-language-container:python3-ds-EXASOL-6.1.0-release)
INFO: DockerBuildImageTask_97b50b885f(image_name=exasol/script-language-container:python3-ds-EXASOL-6.1.0-release): Build docker image exasol/script-language-container:python3-ds-EXASOL-6.1.0-release_OXOVGNSAPBXP72DKRCQIEFCDQT6N4L3CYW2PSBNA4ZNYU4WTQHFQ, log file can be found here .build_output/jobs/2021_01_27_06_50_10_ExportContainers/outputs/ExportContainers_0b5774ca1d/ExportFlavorContainer_3f47542ab1/DockerCreateImageTaskWithDeps_30c3892ee6/DockerBuildImageTask_97b50b885f/logs
ERROR: DockerBuildImageTask_97b50b885f(image_name=exasol/script-language-container:python3-ds-EXASOL-6.1.0-release): Build of image exasol/script-language-container:python3-ds-EXASOL-6.1.0-release_OXOVGNSAPBXP72DKRCQIEFCDQT6N4L3CYW2PSBNA4ZNYU4WTQHFQ failed

Build Log:
Step 1/25 : FROM ubuntu:18.04


---> c090eaba6b94

Step 2/25 : RUN mkdir /conf /buckets


---> Running in 014d3c44a5d2

Removing intermediate container 014d3c44a5d2

---> 576290594156

Step 3/25 : COPY --from=exasol/script-language-container:python3-ds-EXASOL-6.1.0-language_deps_V7LLQGCX2VSG23GDTORDNSEN5QNAJSRGNNATLP6NF636GK4TDFOQ /usr /usr


---> 529e8070d178

Step 4/25 : COPY --from=exasol/script-language-container:python3-ds-EXASOL-6.1.0-language_deps_V7LLQGCX2VSG23GDTORDNSEN5QNAJSRGNNATLP6NF636GK4TDFOQ /lib /lib


---> 64f483da961c

Step 5/25 : COPY --from=exasol/script-language-container:python3-ds-EXASOL-6.1.0-language_deps_V7LLQGCX2VSG23GDTORDNSEN5QNAJSRGNNATLP6NF636GK4TDFOQ /bin /bin


---> d7f77b2de570

Step 6/25 : COPY --from=exasol/script-language-container:python3-ds-EXASOL-6.1.0-language_deps_V7LLQGCX2VSG23GDTORDNSEN5QNAJSRGNNATLP6NF636GK4TDFOQ /opt /opt


---> 5eef0ee641de

Step 7/25 : COPY --from=exasol/script-language-container:python3-ds-EXASOL-6.1.0-language_deps_V7LLQGCX2VSG23GDTORDNSEN5QNAJSRGNNATLP6NF636GK4TDFOQ /etc /etc


ERROR: DockerBuildImageTask_97b50b885f(image_name=exasol/script-language-container:python3-ds-EXASOL-6.1.0-release): Exception in run: Error occurred during the build of the image exasol/script-language-container:python3-ds-EXASOL-6.1.0-release_OXOVGNSAPBXP72DKRCQIEFCDQT6N4L3CYW2PSBNA4ZNYU4WTQHFQ. Received error "failed to export image: failed to create image: failed to get layer sha256:1a8449ff198d160a366f8fe220d76fdd3cb274dbe881b120e984106757ff579c: layer does not exist" .The whole log can be found in /home/saschbek/script-languages-release/.build_output/jobs/2021_01_27_06_50_10_ExportContainers/outputs/ExportContainers_0b5774ca1d/ExportFlavorContainer_3f47542ab1/DockerCreateImageTaskWithDeps_30c3892ee6/DockerBuildImageTask_97b50b885f/logs/docker-build.log
Traceback (most recent call last):
File "/root/.local/share/virtualenvs/script-languages-yGy90RxA/lib/python3.8/site-packages/exasol_integration_test_docker_environment/lib/base/base_task.py", line 224, in run
task_generator = self.run_task()
File "/root/.local/share/virtualenvs/script-languages-yGy90RxA/lib/python3.8/site-packages/exasol_integration_test_docker_environment/lib/docker/images/create/docker_image_build_task.py", line 38, in run_task
self._handle_output(output_generator, self.image_info)
File "/root/.local/share/virtualenvs/script-languages-yGy90RxA/lib/python3.8/site-packages/exasol_integration_test_docker_environment/lib/docker/images/create/docker_image_build_task.py", line 49, in _handle_output
log_handler.handle_log_lines(log_line)
File "/root/.local/share/virtualenvs/script-languages-yGy90RxA/lib/python3.8/site-packages/exasol_integration_test_docker_environment/lib/logging/abstract_log_handler.py", line 21, in __exit__
self.finish()
File "/root/.local/share/virtualenvs/script-languages-yGy90RxA/lib/python3.8/site-packages/exasol_integration_test_docker_environment/lib/docker/images/create/utils/build_log_handler.py", line 29, in finish
self.handle_error()
File "/root/.local/share/virtualenvs/script-languages-yGy90RxA/lib/python3.8/site-packages/exasol_integration_test_docker_environment/lib/docker/images/create/utils/build_log_handler.py", line 40, in handle_error
raise docker.errors.BuildError(
docker.errors.BuildError: Error occurred during the build of the image exasol/script-language-container:python3-ds-EXASOL-6.1.0-release_OXOVGNSAPBXP72DKRCQIEFCDQT6N4L3CYW2PSBNA4ZNYU4WTQHFQ. Received error "failed to export image: failed to create image: failed to get layer sha256:1a8449ff198d160a366f8fe220d76fdd3cb274dbe881b120e984106757ff579c: layer does not exist" .The whole log can be found in /home/saschbek/script-languages-release/.build_output/jobs/2021_01_27_06_50_10_ExportContainers/outputs/ExportContainers_0b5774ca1d/ExportFlavorContainer_3f47542ab1/DockerCreateImageTaskWithDeps_30c3892ee6/DockerBuildImageTask_97b50b885f/logs/docker-build.log
ERROR: [pid 5613] Worker Worker(salt=637065783, workers=5, host=work, username=root, pid=3963, sudo_user=saschbek) failed DockerBuildImageTask_97b50b885f(image_name=exasol/script-language-container:python3-ds-EXASOL-6.1.0-release)
Traceback (most recent call last):
File "/root/.local/share/virtualenvs/script-languages-yGy90RxA/lib/python3.8/site-packages/luigi/worker.py", line 191, in run
new_deps = self._run_get_new_deps()
File "/root/.local/share/virtualenvs/script-languages-yGy90RxA/lib/python3.8/site-packages/luigi/worker.py", line 142, in _run_get_new_deps
requires = next(task_gen)
File "/root/.local/share/virtualenvs/script-languages-yGy90RxA/lib/python3.8/site-packages/exasol_integration_test_docker_environment/lib/base/dependency_logger_base_task.py", line 103, in run
yield from self.write_dependencies_for_generator(
File "/root/.local/share/virtualenvs/script-languages-yGy90RxA/lib/python3.8/site-packages/exasol_integration_test_docker_environment/lib/base/dependency_logger_base_task.py", line 59, in write_dependencies_for_generator
element = next(task_generator)
File "/root/.local/share/virtualenvs/script-languages-yGy90RxA/lib/python3.8/site-packages/exasol_integration_test_docker_environment/lib/base/stoppable_base_task.py", line 31, in run
raise exception
File "/root/.local/share/virtualenvs/script-languages-yGy90RxA/lib/python3.8/site-packages/exasol_integration_test_docker_environment/lib/base/stoppable_base_task.py", line 27, in run
yield from task_generator
File "/root/.local/share/virtualenvs/script-languages-yGy90RxA/lib/python3.8/site-packages/exasol_integration_test_docker_environment/lib/base/timeable_base_task.py", line 120, in run
yield from task_generator
File "/root/.local/share/virtualenvs/script-languages-yGy90RxA/lib/python3.8/site-packages/exasol_integration_test_docker_environment/lib/base/base_task.py", line 232, in run
raise e
File "/root/.local/share/virtualenvs/script-languages-yGy90RxA/lib/python3.8/site-packages/exasol_integration_test_docker_environment/lib/base/base_task.py", line 224, in run
task_generator = self.run_task()
File "/root/.local/share/virtualenvs/script-languages-yGy90RxA/lib/python3.8/site-packages/exasol_integration_test_docker_environment/lib/docker/images/create/docker_image_build_task.py", line 38, in run_task
self._handle_output(output_generator, self.image_info)
File "/root/.local/share/virtualenvs/script-languages-yGy90RxA/lib/python3.8/site-packages/exasol_integration_test_docker_environment/lib/docker/images/create/docker_image_build_task.py", line 49, in _handle_output
log_handler.handle_log_lines(log_line)
File "/root/.local/share/virtualenvs/script-languages-yGy90RxA/lib/python3.8/site-packages/exasol_integration_test_docker_environment/lib/logging/abstract_log_handler.py", line 21, in __exit__
self.finish()
File "/root/.local/share/virtualenvs/script-languages-yGy90RxA/lib/python3.8/site-packages/exasol_integration_test_docker_environment/lib/docker/images/create/utils/build_log_handler.py", line 29, in finish
self.handle_error()
File "/root/.local/share/virtualenvs/script-languages-yGy90RxA/lib/python3.8/site-packages/exasol_integration_test_docker_environment/lib/docker/images/create/utils/build_log_handler.py", line 40, in handle_error
raise docker.errors.BuildError(
docker.errors.BuildError: Error occurred during the build of the image exasol/script-language-container:python3-ds-EXASOL-6.1.0-release_OXOVGNSAPBXP72DKRCQIEFCDQT6N4L3CYW2PSBNA4ZNYU4WTQHFQ. Received error "failed to export image: failed to create image: failed to get layer sha256:1a8449ff198d160a366f8fe220d76fdd3cb274dbe881b120e984106757ff579c: layer does not exist" .The whole log can be found in /home/saschbek/script-languages-release/.build_output/jobs/2021_01_27_06_50_10_ExportContainers/outputs/ExportContainers_0b5774ca1d/ExportFlavorContainer_3f47542ab1/DockerCreateImageTaskWithDeps_30c3892ee6/DockerBuildImageTask_97b50b885f/logs/docker-build.log
INFO: Informed scheduler that task DockerBuildImageTask_97b50b885f has status FAILED
INFO: Worker Worker(salt=637065783, workers=5, host=work, username=root, pid=3963, sudo_user=saschbek) was stopped. Shutting down Keep-Alive thread

 

INFO:
===== Luigi Execution Summary =====

Spoiler
Scheduled 23 tasks of which:
* 16 ran successfully:
- 1 AnalyzeBuildDeps_50238479d4(flavor_path=flavors/python3-ds-EXASOL-6.1.0)
- 1 AnalyzeBuildRun_50238479d4(flavor_path=flavors/python3-ds-EXASOL-6.1.0)
- 1 AnalyzeFlavorBaseDeps_50238479d4(flavor_path=flavors/python3-ds-EXASOL-6.1.0)
- 1 AnalyzeFlavorCustomization_50238479d4(flavor_path=flavors/python3-ds-EXASOL-6.1.0)
- 1 AnalyzeLanguageDeps_50238479d4(flavor_path=flavors/python3-ds-EXASOL-6.1.0)
...
* 1 failed:
- 1 DockerBuildImageTask_97b50b885f(image_name=exasol/script-language-container:python3-ds-EXASOL-6.1.0-release)
* 6 were left pending, among these:
* 2 were missing external dependencies:
- 1 DockerCreateImageTaskWithDeps_30c3892ee6(image_name=exasol/script-language-container:python3-ds-EXASOL-6.1.0-release)
- 1 ExportFlavorContainer(...)
* 2 had missing dependencies:
- 1 ExportContainerTask(...)
- 1 ExportContainers(...)
* 2 was not granted run permission by the scheduler:
- 1 DockerCreateImageTaskWithDeps_30c3892ee6(image_name=exasol/script-language-container:python3-ds-EXASOL-6.1.0-release)
- 1 ExportFlavorContainer(...)

This progress looks 😞 because there were failed tasks

 

===== Luigi Execution Summary =====

Spoiler

 

The command failed after 310.723189 s with:

Task Failures:
- DockerBuildImageTask_97b50b885f:
Traceback (most recent call last):
File "/root/.local/share/virtualenvs/script-languages-yGy90RxA/lib/python3.8/site-packages/exasol_integration_test_docker_environment/lib/base/stoppable_base_task.py", line 27, in run
yield from task_generator
File "/root/.local/share/virtualenvs/script-languages-yGy90RxA/lib/python3.8/site-packages/exasol_integration_test_docker_environment/lib/base/timeable_base_task.py", line 120, in run
yield from task_generator
File "/root/.local/share/virtualenvs/script-languages-yGy90RxA/lib/python3.8/site-packages/exasol_integration_test_docker_environment/lib/base/base_task.py", line 232, in run
raise e
File "/root/.local/share/virtualenvs/script-languages-yGy90RxA/lib/python3.8/site-packages/exasol_integration_test_docker_environment/lib/base/base_task.py", line 224, in run
task_generator = self.run_task()
File "/root/.local/share/virtualenvs/script-languages-yGy90RxA/lib/python3.8/site-packages/exasol_integration_test_docker_environment/lib/docker/images/create/docker_image_build_task.py", line 38, in run_task
self._handle_output(output_generator, self.image_info)
File "/root/.local/share/virtualenvs/script-languages-yGy90RxA/lib/python3.8/site-packages/exasol_integration_test_docker_environment/lib/docker/images/create/docker_image_build_task.py", line 49, in _handle_output
log_handler.handle_log_lines(log_line)
File "/root/.local/share/virtualenvs/script-languages-yGy90RxA/lib/python3.8/site-packages/exasol_integration_test_docker_environment/lib/logging/abstract_log_handler.py", line 21, in __exit__
self.finish()
File "/root/.local/share/virtualenvs/script-languages-yGy90RxA/lib/python3.8/site-packages/exasol_integration_test_docker_environment/lib/docker/images/create/utils/build_log_handler.py", line 29, in finish
self.handle_error()
File "/root/.local/share/virtualenvs/script-languages-yGy90RxA/lib/python3.8/site-packages/exasol_integration_test_docker_environment/lib/docker/images/create/utils/build_log_handler.py", line 40, in handle_error
raise docker.errors.BuildError(
docker.errors.BuildError: Error occurred during the build of the image exasol/script-language-container:python3-ds-EXASOL-6.1.0-release_OXOVGNSAPBXP72DKRCQIEFCDQT6N4L3CYW2PSBNA4ZNYU4WTQHFQ. Received error "failed to export image: failed to create image: failed to get layer sha256:1a8449ff198d160a366f8fe220d76fdd3cb274dbe881b120e984106757ff579c: layer does not exist" .The whole log can be found in /home/saschbek/script-languages-release/.build_output/jobs/2021_01_27_06_50_10_ExportContainers/outputs/ExportContainers_0b5774ca1d/ExportFlavorContainer_3f47542ab1/DockerCreateImageTaskWithDeps_30c3892ee6/DockerBuildImageTask_97b50b885f/logs/docker-build.log

exa-Torsten
Team Exasol
Team Exasol

Thx, for trying again and providing the log. I am going to have a look at it. Can you please also check, if you have enough free disk space under /var. Maybe docker can't load the image, because it has not enough disk space.

Saschbek
Contributor

I had the same idea 😁 But that's not the problem.

2021-01-27 09_53_02-Window.jpg

Saschbek
Contributor

thx for the reply Will try it tomorrow and get back to you.

exa-Torsten
Team Exasol
Team Exasol

Hello Saschbek,

Thanks for your post. Yes, over the weekend some dependencies for the flavors broke, and we are currently fixing the flavors. They should be soon good to go. In case it still persists, please include the next time the exaslct.log This usually simplifies finding the issue. Let me know if it still makes trouble.

exa-Torsten
Team Exasol
Team Exasol

I also tried the python3-ds-EXASOL-6.1.0 flavor with a modified package list for the flavor customization, and it worked fine. So, please retry the build.

View solution in original post